household_id,individual_id,ea_id,saq14,pw_w4,saq01,saq02,saq03,saq04,saq05,saq06,saq07,saq08,s3q01,s3q02,s3q03,s3q04_1,s3q04_2,s3q04_os,s3q05,s3q06_1,s3q06_2,s3q06_os,s3q07,s3q08,s3q09a,s3q09a_os,s3q09b,s3q09b_os,s3q10a,s3q10a_os,s3q10b,s3q10b_os,s3q11,s3q12a,s3q12b,s3q13,s3q13_os,s3q14,s3q15,s3q16,s3q17,s3q18,s3q19,s3q20,s3q21,s3q22,s3q23,s3q24,s3q25,s3q26,s3q27,s3q28,s3q29,s3q30a,s3q30b,s3q31,s3q32,s3q33,s3q34_a,s3q34_b,s3q34_c,s3q35,s3q35_os,s3q36,s3q37,s3q38,s3q39,s3q39_os
010101088800910007,1,010101088800910,1. RURAL,1658.475108571429,1. TIGRAY,01,01,8,88,009,10,7,1. YES,,2. NO,,,,1. YES,23. ULCER/STOMACH PAIN,28. KIDNEY PROBLEM,,1. YES,10,1. DOCTOR,,1. DOCTOR,,1. HOSPITAL,,1. HOSPITAL,,300,2,30,,,1. YES,4,1. YES,10,1300,4. DON'T HAVE HEALTH INSURANCE,1. YES,1. NO DIFFICULTY,3. YES - A LOT OF DIFFICULTY,1. NO DIFFICULTY,1. NO DIFFICULTY,1. NO DIFFICULTY,2. YES - SOME DIFFICULTY,2. NO,,,,,,,,,,,,,,,,,
010101088800910007,2,010101088800910,1. RURAL,1658.475108571429,1. TIGRAY,01,01,8,88,009,10,7,1. YES,,2. NO,,,,2. NO,,,,,,,,,,,,,,,,,,,2. NO,,,,,4. DON'T HAVE HEALTH INSURANCE,1. YES,1. NO DIFFICULTY,2. YES - SOME DIFFICULTY,1. NO DIFFICULTY,1. NO DIFFICULTY,2. YES - SOME DIFFICULTY,1. NO DIFFICULTY,2. NO,,,,,,,,,,,,,,,,,
010101088800910007,3,010101088800910,1. RURAL,1658.475108571429,1. TIGRAY,01,01,8,88,009,10,7,1. YES,,2. NO,,,,2. NO,,,,,,,,,,,,,,,,,,,1. YES,3,2. NO,,800,4. DON'T HAVE HEALTH INSURANCE,1. YES,1. NO DIFFICULTY,1. NO DIFFICULTY,1. NO DIFFICULTY,1. NO DIFFICULTY,1. NO DIFFICULTY,1. NO DIFFICULTY,2. NO,,,,,,,,,,,,,,,,,
010101088800910007,4,010101088800910,1. RURAL,1658.475108571429,1. TIGRAY,01,01,8,88,009,10,7,,,,,,,,,,,,,,,,,,,,,,,,,,,,,,,,,,,,,,,,,,,,,,,,,,,,,,,,
010101088800910007,5,010101088800910,1. RURAL,1658.475108571429,1. TIGRAY,01,01,8,88,009,10,7,2. NO,1,2. NO,,,,2. NO,,,,,,,,,,,,,,,,,,,1. YES,2,2. NO,,300,4. DON'T HAVE HEALTH INSURANCE,1. YES,1. NO DIFFICULTY,1. NO DIFFICULTY,1. NO DIFFICULTY,1. NO DIFFICULTY,1. NO DIFFICULTY,1. NO DIFFICULTY,2. NO,,,,,,,,,,,,,,,,,
010101088800910007,6,010101088800910,1. RURAL,1658.475108571429,1. TIGRAY,01,01,8,88,009,10,7,1. YES,,2. NO,,,,2. NO,,,,,,,,,,,,,,,,,,,1. YES,4,2. NO,,450,4. DON'T HAVE HEALTH INSURANCE,1. YES,1. NO DIFFICULTY,1. NO DIFFICULTY,1. NO DIFFICULTY,1. NO DIFFICULTY,1. NO DIFFICULTY,1. NO DIFFICULTY,2. NO,,,,,,,,,,,,,,,,,
010101088800910007,7,010101088800910,1. RURAL,1658.475108571429,1. TIGRAY,01,01,8,88,009,10,7,2. NO,3,2. NO,,,,2. NO,,,,,,,,,,,,,,,,,,,1. YES,1,2. NO,,0. áˆáŠ•áˆ,4. DON'T HAVE HEALTH INSURANCE,2. NO,,,,,,,1. YES,2. NO,,,,"1. YES,STILL BREASTFEEDING",,6,15,11,2010,4. PARENT RESPONSE,,1. YES,7.6,78,,
010101088800910017,1,010101088800910,1. RURAL,1658.475108571429,1. TIGRAY,01,01,8,88,009,10,17,1. YES,,2. NO,,,,2. NO,,,,,,,,,,,,,,,,,,,1. YES,3,1. YES,8,1690,1. COMMUNITY BASED HEALTH INSURANCE,1. YES,1. NO DIFFICULTY,1. NO DIFFICULTY,1. NO DIFFICULTY,1. NO DIFFICULTY,1. NO DIFFICULTY,1. NO DIFFICULTY,2. NO,,,,,,,,,,,,,,,,,
010101088800910017,2,010101088800910,1. RURAL,1658.475108571429,1. TIGRAY,01,01,8,88,009,10,17,1. YES,,2. NO,,,,2. NO,,,,,,,,,,,,,,,,,,,2. NO,,,,,1. COMMUNITY BASED HEALTH INSURANCE,1. YES,1. NO DIFFICULTY,1. NO DIFFICULTY,1. NO DIFFICULTY,1. NO DIFFICULTY,1. NO DIFFICULTY,1. NO DIFFICULTY,2. NO,,,,,,,,,,,,,,,,,
010101088800910017,3,010101088800910,1. RURAL,1658.475108571429,1. TIGRAY,01,01,8,88,009,10,17,2. NO,1,2. NO,,,,1. YES,1. MALARIA,,,1. YES,2,1. DOCTOR,,,,1. HOSPITAL,,,,36,3,0. NO MINUTES,,,1. YES,1,2. NO,,36,1. COMMUNITY BASED HEALTH INSURANCE,1. YES,1. NO DIFFICULTY,1. NO DIFFICULTY,1. NO DIFFICULTY,1. NO DIFFICULTY,1. NO DIFFICULTY,1. NO DIFFICULTY,2. NO,,,,,,,,,,,,,,,,,
010101088800910017,4,010101088800910,1. RURAL,1658.475108571429,1. TIGRAY,01,01,8,88,009,10,17,1. YES,,2. NO,,,,1. YES,6. DIARRHEA,,,1. YES,2,1. DOCTOR,,,,1. HOSPITAL,,,,120,3,0. NO MINUTES,,,1. YES,1,1. YES,1,120,1. COMMUNITY BASED HEALTH INSURANCE,1. YES,1. NO DIFFICULTY,1. NO DIFFICULTY,1. NO DIFFICULTY,1. NO DIFFICULTY,1. NO DIFFICULTY,1. NO DIFFICULTY,2. NO,,,,,,,,,,,,,,,,,
010101088800910017,5,010101088800910,1. RURAL,1658.475108571429,1. TIGRAY,01,01,8,88,009,10,17,2. NO,1,2. NO,,,,2. NO,,,,,,,,,,,,,,,,,,,2. NO,,,,,1. COMMUNITY BASED HEALTH INSURANCE,2. NO,,,,,,,2. NO,,,,,,,,,,,,,,,,,
010101088800910026,1,010101088800910,1. RURAL,1658.475108571429,1. TIGRAY,01,01,8,88,009,10,26,1. YES,,1. YES,2. PRENATAL CHECKUP,3. GIVING BIRTH,,2. NO,,,,,,,,,,,,,,,,,,,,4,2. NO,,0. áˆáŠ•áˆ,1. COMMUNITY BASED HEALTH INSURANCE,1. YES,1. NO DIFFICULTY,1. NO DIFFICULTY,1. NO DIFFICULTY,1. NO DIFFICULTY,1. NO DIFFICULTY,1. NO DIFFICULTY,2. NO,,,,,,,,,,,,,,,,,
010101088800910026,2,010101088800910,1. RURAL,1658.475108571429,1. TIGRAY,01,01,8,88,009,10,26,2. NO,1,2. NO,,,,2. NO,,,,,,,,,,,,,,,,,,,2. NO,,,,,1. COMMUNITY BASED HEALTH INSURANCE,1. YES,1. NO DIFFICULTY,1. NO DIFFICULTY,1. NO DIFFICULTY,1. NO DIFFICULTY,1. NO DIFFICULTY,1. NO DIFFICULTY,2. NO,,,,,,,,,,,,,,,,,
010101088800910026,3,010101088800910,1. RURAL,1658.475108571429,1. TIGRAY,01,01,8,88,009,10,26,2. NO,1,2. NO,,,,1. YES,1. MALARIA,,,2. NO,,2. HEALTH WORKER,,,,2. HEALTH CENTER,,,,0. áˆáŠ•áˆ,3,0. NO MINUTES,,,2. NO,,,,,1. COMMUNITY BASED HEALTH INSURANCE,1. YES,1. NO DIFFICULTY,1. NO DIFFICULTY,1. NO DIFFICULTY,1. NO DIFFICULTY,1. NO DIFFICULTY,1. NO DIFFICULTY,2. NO,,,,,,,,,,,,,,,,,
010101088800910026,4,010101088800910,1. RURAL,1658.475108571429,1. TIGRAY,01,01,8,88,009,10,26,2. NO,1,2. NO,,,,2. NO,,,,,,,,,,,,,,,,,,,2. NO,,,,,1. COMMUNITY BASED HEALTH INSURANCE,1. YES,1. NO DIFFICULTY,1. NO DIFFICULTY,1. NO DIFFICULTY,1. NO DIFFICULTY,1. NO DIFFICULTY,1. NO DIFFICULTY,2. NO,,,,,,,,,,,,,,,,,
010101088800910026,5,010101088800910,1. RURAL,1658.475108571429,1. TIGRAY,01,01,8,88,009,10,26,2. NO,1,2. NO,,,,2. NO,,,,,,,,,,,,,,,,,,,2. NO,,,,,4. DON'T HAVE HEALTH INSURANCE,1. YES,1. NO DIFFICULTY,1. NO DIFFICULTY,1. NO DIFFICULTY,1. NO DIFFICULTY,1. NO DIFFICULTY,1. NO DIFFICULTY,2. NO,,,,,,,,,,,,,,,,,
010101088800910026,6,010101088800910,1. RURAL,1658.475108571429,1. TIGRAY,01,01,8,88,009,10,26,2. NO,1,2. NO,,,,2. NO,,,,,,,,,,,,,,,,,,,2. NO,,,,,1. COMMUNITY BASED HEALTH INSURANCE,2. NO,,,,,,,2. NO,,,,,,,,,,,,,,,,,
010101088800910026,7,010101088800910,1. RURAL,1658.475108571429,1. TIGRAY,01,01,8,88,009,10,26,2. NO,1,2. NO,,,,2. NO,,,,,,,,,,,,,,,,,,,2. NO,,,,,4. DON'T HAVE HEALTH INSURANCE,2. NO,,,,,,,2. NO,,,,,,,,,,,,,,,,,
010101088800910026,8,010101088800910,1. RURAL,1658.475108571429,1. TIGRAY,01,01,8,88,009,10,26,1. YES,,2. NO,,,,1. YES,19. DYSENTERY,,,1. YES,28,1. DOCTOR,,,,1. HOSPITAL,,,,500,2,35,,,1. YES,3,2. NO,,2000,4. DON'T HAVE HEALTH INSURANCE,1. YES,2. YES - SOME DIFFICULTY,1. NO DIFFICULTY,1. NO DIFFICULTY,1. NO DIFFICULTY,1. NO DIFFICULTY,1. NO DIFFICULTY,2. NO,,,,,,,,,,,,,,,,,
010101088800910029,1,010101088800910,1. RURAL,2892.689142857143,1. TIGRAY,01,01,8,88,009,10,29,1. YES,,2. NO,,,,2. NO,,,,,,,,,,,,,,,,,,,1. YES,2,2. NO,,450,4. DON'T HAVE HEALTH INSURANCE,1. YES,1. NO DIFFICULTY,2. YES - SOME DIFFICULTY,1. NO DIFFICULTY,1. NO DIFFICULTY,1. NO DIFFICULTY,1. NO DIFFICULTY,2. NO,,,,,,,,,,,,,,,,,
010101088800910029,2,010101088800910,1. RURAL,2892.689142857143,1. TIGRAY,01,01,8,88,009,10,29,2. NO,1,2. NO,,,,1. YES,10. COMMON COLD,,,2. NO,,2. HEALTH WORKER,,,,2. HEALTH CENTER,,,,350,2,30,,,1. YES,3,2. NO,,650,4. DON'T HAVE HEALTH INSURANCE,2. NO,,,,,,,1. YES,2. NO,,,,"2. YES,BUT NO LONGER",18,5,13,2,2010,4. PARENT RESPONSE,,1. YES,10.5,82.4,,
010101088800910038,1,010101088800910,1. RURAL,1658.475108571429,1. TIGRAY,01,01,8,88,009,10,38,1. YES,,2. NO,,,,2. NO,,,,,,,,,,,,,,,,,,,1. YES,3,2. NO,,50,1. COMMUNITY BASED HEALTH INSURANCE,1. YES,2. YES - SOME DIFFICULTY,1. NO DIFFICULTY,1. NO DIFFICULTY,1. NO DIFFICULTY,1. NO DIFFICULTY,1. NO DIFFICULTY,2. NO,,,,,,,,,,,,,,,,,
010101088800910038,2,010101088800910,1. RURAL,1658.475108571429,1. TIGRAY,01,01,8,88,009,10,38,1. YES,,2. NO,,,,2. NO,,,,,,,,,,,,,,,,,,,2. NO,,,,,1. COMMUNITY BASED HEALTH INSURANCE,1. YES,2. YES - SOME DIFFICULTY,1. NO DIFFICULTY,1. NO DIFFICULTY,1. NO DIFFICULTY,1. NO DIFFICULTY,1. NO DIFFICULTY,2. NO,,,,,,,,,,,,,,,,,
010101088800910038,3,010101088800910,1. RURAL,1658.475108571429,1. TIGRAY,01,01,8,88,009,10,38,2. NO,1,2. NO,,,,2. NO,,,,,,,,,,,,,,,,,,,2. NO,,,,,1. COMMUNITY BASED HEALTH INSURANCE,1. YES,1. NO DIFFICULTY,1. NO DIFFICULTY,1. NO DIFFICULTY,1. NO DIFFICULTY,1. NO DIFFICULTY,1. NO DIFFICULTY,2. NO,,,,,,,,,,,,,,,,,
010101088800910038,4,010101088800910,1. RURAL,1658.475108571429,1. TIGRAY,01,01,8,88,009,10,38,2. NO,1,2. NO,,,,2. NO,,,,,,,,,,,,,,,,,,,2. NO,,,,,1. COMMUNITY BASED HEALTH INSURANCE,1. YES,1. NO DIFFICULTY,1. NO DIFFICULTY,1. NO DIFFICULTY,1. NO DIFFICULTY,1. NO DIFFICULTY,1. NO DIFFICULTY,2. NO,,,,,,,,,,,,,,,,,
010101088800910038,5,010101088800910,1. RURAL,1658.475108571429,1. TIGRAY,01,01,8,88,009,10,38,2. NO,2,2. NO,,,,1. YES,6. DIARRHEA,,,1. YES,3,3. NURSE,,,,5. PHARMACY,,,,200,3,15,,,1. YES,2,2. NO,,130,1. COMMUNITY BASED HEALTH INSURANCE,1. YES,1. NO DIFFICULTY,1. NO DIFFICULTY,1. NO DIFFICULTY,1. NO DIFFICULTY,1. NO DIFFICULTY,1. NO DIFFICULTY,2. NO,,,,,,,,,,,,,,,,,
010101088800910038,6,010101088800910,1. RURAL,1658.475108571429,1. TIGRAY,01,01,8,88,009,10,38,2. NO,2,2. NO,,,,2. NO,,,,,,,,,,,,,,,,,,,1. YES,6,2. NO,,0. áˆáŠ•áˆ,1. COMMUNITY BASED HEALTH INSURANCE,1. YES,1. NO DIFFICULTY,1. NO DIFFICULTY,1. NO DIFFICULTY,1. NO DIFFICULTY,1. NO DIFFICULTY,1. NO DIFFICULTY,2. NO,,,,,,,,,,,,,,,,,
010101088800910038,7,010101088800910,1. RURAL,1658.475108571429,1. TIGRAY,01,01,8,88,009,10,38,2. NO,1,2. NO,,,,2. NO,,,,,,,,,,,,,,,,,,,2. NO,,,,,1. COMMUNITY BASED HEALTH INSURANCE,1. YES,1. NO DIFFICULTY,1. NO DIFFICULTY,1. NO DIFFICULTY,1. NO DIFFICULTY,1. NO DIFFICULTY,1. NO DIFFICULTY,2. NO,,,,,,,,,,,,,,,,,
010101088800910038,8,010101088800910,1. RURAL,1658.475108571429,1. TIGRAY,01,01,8,88,009,10,38,1. YES,,2. NO,,,,1. YES,13. FLU,,,2. NO,,2. HEALTH WORKER,,,,2. HEALTH CENTER,,,,0. áˆáŠ•áˆ,2,30,,,1. YES,2,2. NO,,0. áˆáŠ•áˆ,1. COMMUNITY BASED HEALTH INSURANCE,1. YES,1. NO DIFFICULTY,1. NO DIFFICULTY,1. NO DIFFICULTY,1. NO DIFFICULTY,1. NO DIFFICULTY,1. NO DIFFICULTY,2. NO,,,,,,,,,,,,,,,,,
010101088800910038,9,010101088800910,1. RURAL,1658.475108571429,1. TIGRAY,01,01,8,88,009,10,38,2. NO,2,2. NO,,,,2. NO,,,,,,,,,,,,,,,,,,,1. YES,2,2. NO,,0. áˆáŠ•áˆ,1. COMMUNITY BASED HEALTH INSURANCE,1. YES,1. NO DIFFICULTY,1. NO DIFFICULTY,1. NO DIFFICULTY,1. NO DIFFICULTY,1. NO DIFFICULTY,1. NO DIFFICULTY,2. NO,,,,,,,,,,,,,,,,,
010101088800910038,10,010101088800910,1. RURAL,1658.475108571429,1. TIGRAY,01,01,8,88,009,10,38,2. NO,1,2. NO,,,,2. NO,,,,,,,,,,,,,,,,,,,1. YES,4,1. YES,3,450,4. DON'T HAVE HEALTH INSURANCE,1. YES,1. NO DIFFICULTY,1. NO DIFFICULTY,1. NO DIFFICULTY,1. NO DIFFICULTY,1. NO DIFFICULTY,1. NO DIFFICULTY,2. NO,,,,,,,,,,,,,,,,,
010101088800910038,11,010101088800910,1. RURAL,1658.475108571429,1. TIGRAY,01,01,8,88,009,10,38,2. NO,2,2. NO,,,,1. YES,1. MALARIA,,,1. YES,3,3. NURSE,,,,5. PHARMACY,,,,70,3,15,,,1. YES,2,2. NO,,230,4. DON'T HAVE HEALTH INSURANCE,2. NO,,,,,,,1. YES,2. NO,,,,"2. YES,BUT NO LONGER",23,6,4,9,2008,4. PARENT RESPONSE,,2. NO,,,1. NOT PRESENT,
010101088800910046,1,010101088800910,1. RURAL,1658.475108571429,1. TIGRAY,01,01,8,88,009,10,46,1. YES,,2. NO,,,,1. YES,1. MALARIA,,,1. YES,7,2. HEALTH WORKER,,,,2. HEALTH CENTER,,,,40,2,45,,,2. NO,,,,,1. COMMUNITY BASED HEALTH INSURANCE,1. YES,1. NO DIFFICULTY,1. NO DIFFICULTY,1. NO DIFFICULTY,1. NO DIFFICULTY,1. NO DIFFICULTY,1. NO DIFFICULTY,2. NO,,,,,,,,,,,,,,,,,
010101088800910046,2,010101088800910,1. RURAL,1658.475108571429,1. TIGRAY,01,01,8,88,009,10,46,1. YES,,1. YES,6. NEW OR ACUTE ILLNESS,,,,1. MALARIA,4. TYPHOID,,1. YES,3,3. NURSE,,3. NURSE,,2. HEALTH CENTER,,2. HEALTH CENTER,,0. áˆáŠ•áˆ,2,0. NO MINUTES,,,,2,2. NO,,0. áˆáŠ•áˆ,1. COMMUNITY BASED HEALTH INSURANCE,1. YES,1. NO DIFFICULTY,1. NO DIFFICULTY,1. NO DIFFICULTY,1. NO DIFFICULTY,1. NO DIFFICULTY,1. NO DIFFICULTY,2. NO,,,,,,,,,,,,,,,,,
010101088800910046,3,010101088800910,1. RURAL,1658.475108571429,1. TIGRAY,01,01,8,88,009,10,46,2. NO,1,2. NO,,,,2. NO,,,,,,,,,,,,,,,,,,,1. YES,1,2. NO,,0. áˆáŠ•áˆ,1. COMMUNITY BASED HEALTH INSURANCE,1. YES,1. NO DIFFICULTY,1. NO DIFFICULTY,1. NO DIFFICULTY,1. NO DIFFICULTY,1. NO DIFFICULTY,1. NO DIFFICULTY,2. NO,,,,,,,,,,,,,,,,,
010101088800910046,4,010101088800910,1. RURAL,1658.475108571429,1. TIGRAY,01,01,8,88,009,10,46,2. NO,1,2. NO,,,,2. NO,,,,,,,,,,,,,,,,,,,1. YES,3,2. NO,,0. áˆáŠ•áˆ,1. COMMUNITY BASED HEALTH INSURANCE,1. YES,1. NO DIFFICULTY,1. NO DIFFICULTY,1. NO DIFFICULTY,1. NO DIFFICULTY,1. NO DIFFICULTY,1. NO DIFFICULTY,2. NO,,,,,,,,,,,,,,,,,
010101088800910046,5,010101088800910,1. RURAL,1658.475108571429,1. TIGRAY,01,01,8,88,009,10,46,2. NO,1,2. NO,,,,1. YES,1. MALARIA,,,2. NO,,2. HEALTH WORKER,,,,1. HOSPITAL,,,,100,2,45,,,1. YES,2,1. YES,5,0. áˆáŠ•áˆ,1. COMMUNITY BASED HEALTH INSURANCE,2. NO,,,,,,,1. YES,2. NO,,,,"1. YES,STILL BREASTFEEDING",,5,29,12,2010,4. PARENT RESPONSE,,1. YES,8.6,78.4,,
010101088800910054,1,010101088800910,1. RURAL,1658.475108571429,1. TIGRAY,01,01,8,88,009,10,54,1. YES,,2. NO,,,,2. NO,,,,,,,,,,,,,,,,,,,1. YES,2,2. NO,,100,4. DON'T HAVE HEALTH INSURANCE,1. YES,1. NO DIFFICULTY,1. NO DIFFICULTY,1. NO DIFFICULTY,1. NO DIFFICULTY,1. NO DIFFICULTY,1. NO DIFFICULTY,2. NO,,,,,,,,,,,,,,,,,
010101088800910054,2,010101088800910,1. RURAL,1658.475108571429,1. TIGRAY,01,01,8,88,009,10,54,1. YES,,2. NO,,,,2. NO,,,,,,,,,,,,,,,,,,,1. YES,3,2. NO,,180,4. DON'T HAVE HEALTH INSURANCE,1. YES,1. NO DIFFICULTY,1. NO DIFFICULTY,1. NO DIFFICULTY,1. NO DIFFICULTY,1. NO DIFFICULTY,1. NO DIFFICULTY,2. NO,,,,,,,,,,,,,,,,,
010101088800910054,3,010101088800910,1. RURAL,1658.475108571429,1. TIGRAY,01,01,8,88,009,10,54,2. NO,1,2. NO,,,,1. YES,1. MALARIA,,,2. NO,,3. NURSE,,,,2. HEALTH CENTER,,,,0. áˆáŠ•áˆ,0. NO HOURS,45,,,1. YES,4,2. NO,,250,4. DON'T HAVE HEALTH INSURANCE,2. NO,,,,,,,1. YES,2. NO,,,,"2. YES,BUT NO LONGER",14,4,20,1,2009,3. OTHER DOCUMENTS,,1. YES,12.5,85,,
010101088800910062,1,010101088800910,1. RURAL,1658.475108571429,1. TIGRAY,01,01,8,88,009,10,62,1. YES,,2. NO,,,,2. NO,,,,,,,,,,,,,,,,,,,2. NO,,,,,1. COMMUNITY BASED HEALTH INSURANCE,1. YES,1. NO DIFFICULTY,2. YES - SOME DIFFICULTY,1. NO DIFFICULTY,1. NO DIFFICULTY,1. NO DIFFICULTY,1. NO DIFFICULTY,2. NO,,,,,,,,,,,,,,,,,
010101088800910062,2,010101088800910,1. RURAL,1658.475108571429,1. TIGRAY,01,01,8,88,009,10,62,1. YES,,2. NO,,,,1. YES,1. MALARIA,5. CHOLERA,,1. YES,3,2. HEALTH WORKER,,2. HEALTH WORKER,,1. HOSPITAL,,1. HOSPITAL,,0. áˆáŠ•áˆ,2,30,,,1. YES,3,2. NO,,0. áˆáŠ•áˆ,1. COMMUNITY BASED HEALTH INSURANCE,1. YES,1. NO DIFFICULTY,1. NO DIFFICULTY,1. NO DIFFICULTY,1. NO DIFFICULTY,1. NO DIFFICULTY,1. NO DIFFICULTY,2. NO,,,,,,,,,,,,,,,,,
010101088800910062,3,010101088800910,1. RURAL,1658.475108571429,1. TIGRAY,01,01,8,88,009,10,62,2. NO,1,2. NO,,,,2. NO,,,,,,,,,,,,,,,,,,,2. NO,,,,,1. COMMUNITY BASED HEALTH INSURANCE,1. YES,1. NO DIFFICULTY,1. NO DIFFICULTY,1. NO DIFFICULTY,1. NO DIFFICULTY,1. NO DIFFICULTY,1. NO DIFFICULTY,2. NO,,,,,,,,,,,,,,,,,
010101088800910062,4,010101088800910,1. RURAL,1658.475108571429,1. TIGRAY,01,01,8,88,009,10,62,2. NO,1,2. NO,,,,2. NO,,,,,,,,,,,,,,,,,,,2. NO,,,,,4. DON'T HAVE HEALTH INSURANCE,1. YES,1. NO DIFFICULTY,1. NO DIFFICULTY,1. NO DIFFICULTY,1. NO DIFFICULTY,1. NO DIFFICULTY,1. NO DIFFICULTY,2. NO,,,,,,,,,,,,,,,,,
010101088800910062,5,010101088800910,1. RURAL,1658.475108571429,1. TIGRAY,01,01,8,88,009,10,62,2. NO,1,2. NO,,,,2. NO,,,,,,,,,,,,,,,,,,,2. NO,,,,,1. COMMUNITY BASED HEALTH INSURANCE,1. YES,1. NO DIFFICULTY,1. NO DIFFICULTY,1. NO DIFFICULTY,1. NO DIFFICULTY,1. NO DIFFICULTY,1. NO DIFFICULTY,2. NO,,,,,,,,,,,,,,,,,
010101088800910062,6,010101088800910,1. RURAL,1658.475108571429,1. TIGRAY,01,01,8,88,009,10,62,,,,,,,,,,,,,,,,,,,,,,,,,,,,,,,,,,,,,,,,,,,,,,,,,,,,,,,,
010101088800910070,1,010101088800910,1. RURAL,1658.475108571429,1. TIGRAY,01,01,8,88,009,10,70,1. YES,,2. NO,,,,1. YES,1. MALARIA,,,1. YES,3,2. HEALTH WORKER,,,,1. HOSPITAL,,,,60,2,30,,,2. NO,,,,,4. DON'T HAVE HEALTH INSURANCE,1. YES,1. NO DIFFICULTY,2. YES - SOME DIFFICULTY,1. NO DIFFICULTY,3. YES - A LOT OF DIFFICULTY,2. YES - SOME DIFFICULTY,2. YES - SOME DIFFICULTY,2. NO,,,,,,,,,,,,,,,,,
010101088800910070,2,010101088800910,1. RURAL,1658.475108571429,1. TIGRAY,01,01,8,88,009,10,70,2. NO,1,1. YES,4. FOLLOW UP APPOINTMENT FOR EARLIER OR CHRONIC ILLNESS,,,,17. DIABETES,,,1. YES,28,2. HEALTH WORKER,,,,1. HOSPITAL,,,,0. áˆáŠ•áˆ,2,30,,,,4,2. NO,,400,4. DON'T HAVE HEALTH INSURANCE,1. YES,1. NO DIFFICULTY,3. YES - A LOT OF DIFFICULTY,1. NO DIFFICULTY,3. YES - A LOT OF DIFFICULTY,3. YES - A LOT OF DIFFICULTY,3. YES - A LOT OF DIFFICULTY,2. NO,,,,,,,,,,,,,,,,,
010101088800910070,3,010101088800910,1. RURAL,1658.475108571429,1. TIGRAY,01,01,8,88,009,10,70,2. NO,1,2. NO,,,,2. NO,,,,,,,,,,,,,,,,,,,2. NO,,,,,4. DON'T HAVE HEALTH INSURANCE,1. YES,1. NO DIFFICULTY,1. NO DIFFICULTY,1. NO DIFFICULTY,1. NO DIFFICULTY,1. NO DIFFICULTY,1. NO DIFFICULTY,2. NO,,,,,,,,,,,,,,,,,
010101088800910070,4,010101088800910,1. RURAL,1658.475108571429,1. TIGRAY,01,01,8,88,009,10,70,2. NO,1,2. NO,,,,1. YES,10. COMMON COLD,,,1. YES,3,2. HEALTH WORKER,,,,1. HOSPITAL,,,,360,2,30,,,2. NO,,,,,4. DON'T HAVE HEALTH INSURANCE,1. YES,1. NO DIFFICULTY,1. NO DIFFICULTY,1. NO DIFFICULTY,1. NO DIFFICULTY,1. NO DIFFICULTY,1. NO DIFFICULTY,2. NO,,,,,,,,,,,,,,,,,
010101088800910082,1,010101088800910,1. RURAL,1658.475108571429,1. TIGRAY,01,01,8,88,009,10,82,1. YES,,2. NO,,,,1. YES,1. MALARIA,,,1. YES,3,2. HEALTH WORKER,,,,1. HOSPITAL,,,,250,2,30,,,1. YES,3,2. NO,,650,4. DON'T HAVE HEALTH INSURANCE,1. YES,1. NO DIFFICULTY,1. NO DIFFICULTY,1. NO DIFFICULTY,1. NO DIFFICULTY,1. NO DIFFICULTY,2. YES - SOME DIFFICULTY,2. NO,,,,,,,,,,,,,,,,,
010101088800910082,2,010101088800910,1. RURAL,1658.475108571429,1. TIGRAY,01,01,8,88,009,10,82,1. YES,,2. NO,,,,2. NO,,,,,,,,,,,,,,,,,,,2. NO,,,,,4. DON'T HAVE HEALTH INSURANCE,1. YES,1. NO DIFFICULTY,1. NO DIFFICULTY,1. NO DIFFICULTY,1. NO DIFFICULTY,1. NO DIFFICULTY,1. NO DIFFICULTY,2. NO,,,,,,,,,,,,,,,,,
010101088800910082,3,010101088800910,1. RURAL,1658.475108571429,1. TIGRAY,01,01,8,88,009,10,82,2. NO,2,2. NO,,,,2. NO,,,,,,,,,,,,,,,,,,,1. YES,2,1. YES,3,800,4. DON'T HAVE HEALTH INSURANCE,1. YES,1. NO DIFFICULTY,1. NO DIFFICULTY,1. NO DIFFICULTY,1. NO DIFFICULTY,1. NO DIFFICULTY,1. NO DIFFICULTY,2. NO,,,,,,,,,,,,,,,,,
010101088800910082,4,010101088800910,1. RURAL,1658.475108571429,1. TIGRAY,01,01,8,88,009,10,82,2. NO,2,2. NO,,,,2. NO,,,,,,,,,,,,,,,,,,,1. YES,1,2. NO,,300,4. DON'T HAVE HEALTH INSURANCE,2. NO,,,,,,,1. YES,2. NO,,,,"2. YES,BUT NO LONGER",20,5,5,3,2008,4. PARENT RESPONSE,,1. YES,14.3,86.5,,
010101088800910082,5,010101088800910,1. RURAL,1658.475108571429,1. TIGRAY,01,01,8,88,009,10,82,2. NO,2,2. NO,,,,2. NO,,,,,,,,,,,,,,,,,,,1. YES,2,2. NO,,200,4. DON'T HAVE HEALTH INSURANCE,2. NO,,,,,,,1. YES,2. NO,,,,"1. YES,STILL BREASTFEEDING",,5,13,12,2010,4. PARENT RESPONSE,,2. NO,,,3. REFUSED,
010101088800910093,1,010101088800910,1. RURAL,1658.475108571429,1. TIGRAY,01,01,8,88,009,10,93,1. YES,,1. YES,6. NEW OR ACUTE ILLNESS,,,,1. MALARIA,12. STRESS,,1. YES,4,2. HEALTH WORKER,,2. HEALTH WORKER,,2. HEALTH CENTER,,2. HEALTH CENTER,,0. áˆáŠ•áˆ,2,35,,,,4,2. NO,,0. áˆáŠ•áˆ,1. COMMUNITY BASED HEALTH INSURANCE,1. YES,1. NO DIFFICULTY,2. YES - SOME DIFFICULTY,1. NO DIFFICULTY,1. NO DIFFICULTY,1. NO DIFFICULTY,1. NO DIFFICULTY,2. NO,,,,,,,,,,,,,,,,,
010101088800910093,2,010101088800910,1. RURAL,1658.475108571429,1. TIGRAY,01,01,8,88,009,10,93,1. YES,,2. NO,,,,2. NO,,,,,,,,,,,,,,,,,,,2. NO,,,,,4. DON'T HAVE HEALTH INSURANCE,1. YES,1. NO DIFFICULTY,1. NO DIFFICULTY,1. NO DIFFICULTY,1. NO DIFFICULTY,1. NO DIFFICULTY,1. NO DIFFICULTY,2. NO,,,,,,,,,,,,,,,,,
010101088800910093,3,010101088800910,1. RURAL,1658.475108571429,1. TIGRAY,01,01,8,88,009,10,93,1. YES,,2. NO,,,,2. NO,,,,,,,,,,,,,,,,,,,2. NO,,,,,4. DON'T HAVE HEALTH INSURANCE,1. YES,1. NO DIFFICULTY,1. NO DIFFICULTY,1. NO DIFFICULTY,1. NO DIFFICULTY,1. NO DIFFICULTY,1. NO DIFFICULTY,2. NO,,,,,,,,,,,,,,,,,
010101088800910093,4,010101088800910,1. RURAL,1658.475108571429,1. TIGRAY,01,01,8,88,009,10,93,1. YES,,2. NO,,,,2. NO,,,,,,,,,,,,,,,,,,,1. YES,3,2. NO,,765,4. DON'T HAVE HEALTH INSURANCE,1. YES,1. NO DIFFICULTY,1. NO DIFFICULTY,1. NO DIFFICULTY,1. NO DIFFICULTY,1. NO DIFFICULTY,1. NO DIFFICULTY,2. NO,,,,,,,,,,,,,,,,,
010101088800910093,5,010101088800910,1. RURAL,1658.475108571429,1. TIGRAY,01,01,8,88,009,10,93,2. NO,1,2. NO,,,,2. NO,,,,,,,,,,,,,,,,,,,2. NO,,,,,1. COMMUNITY BASED HEALTH INSURANCE,1. YES,1. NO DIFFICULTY,1. NO DIFFICULTY,1. NO DIFFICULTY,1. NO DIFFICULTY,1. NO DIFFICULTY,1. NO DIFFICULTY,2. NO,,,,,,,,,,,,,,,,,
010102088801010034,1,010102088801010,1. RURAL,4968.359214830971,1. TIGRAY,01,02,8,88,010,10,34,1. YES,,2. NO,,,,2. NO,,,,,,,,,,,,,,,,,,,1. YES,3,2. NO,,0. áˆáŠ•áˆ,2. PRIVATE HEALTH INSURANCE (FROM FINANCIAL INSTITUTIONS),1. YES,1. NO DIFFICULTY,1. NO DIFFICULTY,2. YES - SOME DIFFICULTY,1. NO DIFFICULTY,1. NO DIFFICULTY,1. NO DIFFICULTY,2. NO,,,,,,,,,,,,,,,,,
010102088801010034,2,010102088801010,1. RURAL,4968.359214830971,1. TIGRAY,01,02,8,88,010,10,34,2. NO,1,2. NO,,,,2. NO,,,,,,,,,,,,,,,,,,,2. NO,,,,,2. PRIVATE HEALTH INSURANCE (FROM FINANCIAL INSTITUTIONS),1. YES,1. NO DIFFICULTY,1. NO DIFFICULTY,1. NO DIFFICULTY,1. NO DIFFICULTY,1. NO DIFFICULTY,1. NO DIFFICULTY,2. NO,,,,,,,,,,,,,,,,,
010102088801010034,3,010102088801010,1. RURAL,4968.359214830971,1. TIGRAY,01,02,8,88,010,10,34,2. NO,1,2. NO,,,,2. NO,,,,,,,,,,,,,,,,,,,2. NO,,,,,2. PRIVATE HEALTH INSURANCE (FROM FINANCIAL INSTITUTIONS),1. YES,1. NO DIFFICULTY,1. NO DIFFICULTY,1. NO DIFFICULTY,1. NO DIFFICULTY,1. NO DIFFICULTY,1. NO DIFFICULTY,2. NO,,,,,,,,,,,,,,,,,
010102088801010035,1,010102088801010,1. RURAL,2821.537331879317,1. TIGRAY,01,02,8,88,010,10,35,1. YES,,2. NO,,,,2. NO,,,,,,,,,,,,,,,,,,,2. NO,,,,,4. DON'T HAVE HEALTH INSURANCE,1. YES,1. NO DIFFICULTY,1. NO DIFFICULTY,1. NO DIFFICULTY,1. NO DIFFICULTY,1. NO DIFFICULTY,1. NO DIFFICULTY,2. NO,,,,,,,,,,,,,,,,,
010102088801010035,2,010102088801010,1. RURAL,2821.537331879317,1. TIGRAY,01,02,8,88,010,10,35,2. NO,1,2. NO,,,,2. NO,,,,,,,,,,,,,,,,,,,2. NO,,,,,4. DON'T HAVE HEALTH INSURANCE,1. YES,1. NO DIFFICULTY,1. NO DIFFICULTY,1. NO DIFFICULTY,1. NO DIFFICULTY,1. NO DIFFICULTY,1. NO DIFFICULTY,2. NO,,,,,,,,,,,,,,,,,
010102088801010048,1,010102088801010,1. RURAL,2821.537331879317,1. TIGRAY,01,02,8,88,010,10,48,1. YES,,2. NO,,,,2. NO,,,,,,,,,,,,,,,,,,,2. NO,,,,,4. DON'T HAVE HEALTH INSURANCE,1. YES,1. NO DIFFICULTY,1. NO DIFFICULTY,1. NO DIFFICULTY,1. NO DIFFICULTY,1. NO DIFFICULTY,1. NO DIFFICULTY,2. NO,,,,,,,,,,,,,,,,,
010102088801010048,2,010102088801010,1. RURAL,2821.537331879317,1. TIGRAY,01,02,8,88,010,10,48,2. NO,1,2. NO,,,,2. NO,,,,,,,,,,,,,,,,,,,2. NO,,,,,4. DON'T HAVE HEALTH INSURANCE,1. YES,1. NO DIFFICULTY,1. NO DIFFICULTY,1. NO DIFFICULTY,1. NO DIFFICULTY,1. NO DIFFICULTY,1. NO DIFFICULTY,2. NO,,,,,,,,,,,,,,,,,
010102088801010048,3,010102088801010,1. RURAL,2821.537331879317,1. TIGRAY,01,02,8,88,010,10,48,2. NO,1,2. NO,,,,2. NO,,,,,,,,,,,,,,,,,,,2. NO,,,,,4. DON'T HAVE HEALTH INSURANCE,1. YES,1. NO DIFFICULTY,1. NO DIFFICULTY,1. NO DIFFICULTY,1. NO DIFFICULTY,1. NO DIFFICULTY,1. NO DIFFICULTY,2. NO,,,,,,,,,,,,,,,,,
010102088801010068,1,010102088801010,1. RURAL,2821.537331879317,1. TIGRAY,01,02,8,88,010,10,68,1. YES,,2. NO,,,,2. NO,,,,,,,,,,,,,,,,,,,2. NO,,,,,2. PRIVATE HEALTH INSURANCE (FROM FINANCIAL INSTITUTIONS),1. YES,1. NO DIFFICULTY,1. NO DIFFICULTY,1. NO DIFFICULTY,1. NO DIFFICULTY,1. NO DIFFICULTY,1. NO DIFFICULTY,2. NO,,,,,,,,,,,,,,,,,
010102088801010068,2,010102088801010,1. RURAL,2821.537331879317,1. TIGRAY,01,02,8,88,010,10,68,2. NO,1,2. NO,,,,2. NO,,,,,,,,,,,,,,,,,,,1. YES,4,2. NO,,0. áˆáŠ•áˆ,2. PRIVATE HEALTH INSURANCE (FROM FINANCIAL INSTITUTIONS),1. YES,1. NO DIFFICULTY,1. NO DIFFICULTY,1. NO DIFFICULTY,1. NO DIFFICULTY,1. NO DIFFICULTY,1. NO DIFFICULTY,2. NO,,,,,,,,,,,,,,,,,